clang++ code/main.cpp -o Simpler-9C3A5F27 -O3 -std=c++2a -march=native -pthread -flto -fno-exceptions -fno-rtti -DNDEBUG -ffast-math -funroll-loops
In file included from code/main.cpp:4:
In file included from code/searcher.h:8:
code/moveListGeneration.h:103:59: error: no member named 'sseEval' in 'MoveGeneration'; did you mean 'seeEval'?
captureEval = sseEval = moveGenerator.sseEval(board, targetSquare, color, startSquare);
^~~~~~~
seeEval
code/moveGeneration.h:280:9: note: 'seeEval' declared here
int seeEval(Board &board, int square, int color, int firstAttacker) {
^
In file included from code/main.cpp:4:
code/searcher.h:262:35: error: no member named 'sseEval' in 'MoveGeneration'; did you mean 'seeEval'?
seeEval = moveGenerator.sseEval(board, move.getTargetSquare(), color, move.getStartSquare());
^~~~~~~
seeEval
code/moveGeneration.h:280:9: note: 'seeEval' declared here
int seeEval(Board &board, int square, int color, int firstAttacker) {
^
In file included from code/main.cpp:4:
code/searcher.h:652:39: error: no member named 'sseEval' in 'MoveGeneration'; did you mean 'seeEval'?
sseEval = moveGenerator.sseEval(board, move.getTargetSquare(), color, move.getStartSquare());
^~~~~~~
seeEval
code/moveGeneration.h:280:9: note: 'seeEval' declared here
int seeEval(Board &board, int square, int color, int firstAttacker) {
^
In file included from code/main.cpp:25:
code/texel.h:117:82: warning: implicit conversion from 'long long' to 'float' changes value from -1000000010 to -1.0E+9 [-Wimplicit-int-float-conversion]
int qEval = worker.texelSearch(mainBoard, mainBoard.boardColor, -inf * 10, inf * 10, 0);
~~~~~~~~~~~ ~~~~~^~~~
code/texel.h:117:92: warning: implicit conversion from 'long long' to 'float' changes value from 1000000010 to 1.0E+9 [-Wimplicit-int-float-conversion]
int qEval = worker.texelSearch(mainBoard, mainBoard.boardColor, -inf * 10, inf * 10, 0);
~~~~~~~~~~~ ~~~~^~~~
2 warnings and 3 errors generated.
make: *** [Makefile:4: all] Error 1