mkdir -p ".tmp" ".tmp/Source"
gcc -funroll-loops -fomit-frame-pointer -O3 -flto -fno-exceptions -DIS_64BIT -DNDEBUG -Wall -Wextra -Wno-unused-variable -DUSE_AVX2 -DUSE_SIMD -mavx2 -mbmi -mbmi2 -march=native -MMD -MP -c bench.c -o .tmp/bench.o -pthread -lm
gcc -funroll-loops -fomit-frame-pointer -O3 -flto -fno-exceptions -DIS_64BIT -DNDEBUG -Wall -Wextra -Wno-unused-variable -DUSE_AVX2 -DUSE_SIMD -mavx2 -mbmi -mbmi2 -march=native -MMD -MP -c bit_manipulation.c -o .tmp/bit_manipulation.o -pthread -lm
gcc -funroll-loops -fomit-frame-pointer -O3 -flto -fno-exceptions -DIS_64BIT -DNDEBUG -Wall -Wextra -Wno-unused-variable -DUSE_AVX2 -DUSE_SIMD -mavx2 -mbmi -mbmi2 -march=native -MMD -MP -c board_constants.c -o .tmp/board_constants.o -pthread -lm
gcc -funroll-loops -fomit-frame-pointer -O3 -flto -fno-exceptions -DIS_64BIT -DNDEBUG -Wall -Wextra -Wno-unused-variable -DUSE_AVX2 -DUSE_SIMD -mavx2 -mbmi -mbmi2 -march=native -MMD -MP -c datagen.c -o .tmp/datagen.o -pthread -lm
gcc -funroll-loops -fomit-frame-pointer -O3 -flto -fno-exceptions -DIS_64BIT -DNDEBUG -Wall -Wextra -Wno-unused-variable -DUSE_AVX2 -DUSE_SIMD -mavx2 -mbmi -mbmi2 -march=native -MMD -MP -c evaluation.c -o .tmp/evaluation.o -pthread -lm
gcc -funroll-loops -fomit-frame-pointer -O3 -flto -fno-exceptions -DIS_64BIT -DNDEBUG -Wall -Wextra -Wno-unused-variable -DUSE_AVX2 -DUSE_SIMD -mavx2 -mbmi -mbmi2 -march=native -MMD -MP -c fen.c -o .tmp/fen.o -pthread -lm
gcc -funroll-loops -fomit-frame-pointer -O3 -flto -fno-exceptions -DIS_64BIT -DNDEBUG -Wall -Wextra -Wno-unused-variable -DUSE_AVX2 -DUSE_SIMD -mavx2 -mbmi -mbmi2 -march=native -MMD -MP -c generate_fen.c -o .tmp/generate_fen.o -pthread -lm
gcc -funroll-loops -fomit-frame-pointer -O3 -flto -fno-exceptions -DIS_64BIT -DNDEBUG -Wall -Wextra -Wno-unused-variable -DUSE_AVX2 -DUSE_SIMD -mavx2 -mbmi -mbmi2 -march=native -MMD -MP -c history.c -o .tmp/history.o -pthread -lm
gcc -funroll-loops -fomit-frame-pointer -O3 -flto -fno-exceptions -DIS_64BIT -DNDEBUG -Wall -Wextra -Wno-unused-variable -DUSE_AVX2 -DUSE_SIMD -mavx2 -mbmi -mbmi2 -march=native -MMD -MP -c magic.c -o .tmp/magic.o -pthread -lm
gcc -funroll-loops -fomit-frame-pointer -O3 -flto -fno-exceptions -DIS_64BIT -DNDEBUG -Wall -Wextra -Wno-unused-variable -DUSE_AVX2 -DUSE_SIMD -mavx2 -mbmi -mbmi2 -march=native -MMD -MP -c mask.c -o .tmp/mask.o -pthread -lm
gcc -funroll-loops -fomit-frame-pointer -O3 -flto -fno-exceptions -DIS_64BIT -DNDEBUG -Wall -Wextra -Wno-unused-variable -DUSE_AVX2 -DUSE_SIMD -mavx2 -mbmi -mbmi2 -march=native -MMD -MP -c move.c -o .tmp/move.o -pthread -lm
gcc -funroll-loops -fomit-frame-pointer -O3 -flto -fno-exceptions -DIS_64BIT -DNDEBUG -Wall -Wextra -Wno-unused-variable -DUSE_AVX2 -DUSE_SIMD -mavx2 -mbmi -mbmi2 -march=native -MMD -MP -c movepicker.c -o .tmp/movepicker.o -pthread -lm
gcc -funroll-loops -fomit-frame-pointer -O3 -flto -fno-exceptions -DIS_64BIT -DNDEBUG -Wall -Wextra -Wno-unused-variable -DUSE_AVX2 -DUSE_SIMD -mavx2 -mbmi -mbmi2 -march=native -MMD -MP -c perft.c -o .tmp/perft.o -pthread -lm
gcc -funroll-loops -fomit-frame-pointer -O3 -flto -fno-exceptions -DIS_64BIT -DNDEBUG -Wall -Wextra -Wno-unused-variable -DUSE_AVX2 -DUSE_SIMD -mavx2 -mbmi -mbmi2 -march=native -MMD -MP -c potential.c -o .tmp/potential.o -pthread -lm
gcc -funroll-loops -fomit-frame-pointer -O3 -flto -fno-exceptions -DIS_64BIT -DNDEBUG -Wall -Wextra -Wno-unused-variable -DUSE_AVX2 -DUSE_SIMD -mavx2 -mbmi -mbmi2 -march=native -MMD -MP -c search.c -o .tmp/search.o -pthread -lm
gcc -funroll-loops -fomit-frame-pointer -O3 -flto -fno-exceptions -DIS_64BIT -DNDEBUG -Wall -Wextra -Wno-unused-variable -DUSE_AVX2 -DUSE_SIMD -mavx2 -mbmi -mbmi2 -march=native -MMD -MP -c see.c -o .tmp/see.o -pthread -lm
gcc -funroll-loops -fomit-frame-pointer -O3 -flto -fno-exceptions -DIS_64BIT -DNDEBUG -Wall -Wextra -Wno-unused-variable -DUSE_AVX2 -DUSE_SIMD -mavx2 -mbmi -mbmi2 -march=native -MMD -MP -c table.c -o .tmp/table.o -pthread -lm
gcc -funroll-loops -fomit-frame-pointer -O3 -flto -fno-exceptions -DIS_64BIT -DNDEBUG -Wall -Wextra -Wno-unused-variable -DUSE_AVX2 -DUSE_SIMD -mavx2 -mbmi -mbmi2 -march=native -MMD -MP -c threads.c -o .tmp/threads.o -pthread -lm
gcc -funroll-loops -fomit-frame-pointer -O3 -flto -fno-exceptions -DIS_64BIT -DNDEBUG -Wall -Wextra -Wno-unused-variable -DUSE_AVX2 -DUSE_SIMD -mavx2 -mbmi -mbmi2 -march=native -MMD -MP -c timeman.c -o .tmp/timeman.o -pthread -lm
gcc -funroll-loops -fomit-frame-pointer -O3 -flto -fno-exceptions -DIS_64BIT -DNDEBUG -Wall -Wextra -Wno-unused-variable -DUSE_AVX2 -DUSE_SIMD -mavx2 -mbmi -mbmi2 -march=native -MMD -MP -c uci.c -o .tmp/uci.o -pthread -lm
gcc -funroll-loops -fomit-frame-pointer -O3 -flto -fno-exceptions -DIS_64BIT -DNDEBUG -Wall -Wextra -Wno-unused-variable -DUSE_AVX2 -DUSE_SIMD -mavx2 -mbmi -mbmi2 -march=native -MMD -MP -c utils.c -o .tmp/utils.o -pthread -lm
search.c: In function ‘searchPosition’:
search.c:1926:48: warning: format ‘%llu’ expects argument of type ‘long long unsigned int’, but argument 3 has type ‘uint64_t’ {aka ‘long unsigned int’} [-Wformat=]
1926 | printf("score mate %d nodes %llu nps %llu hashfull %d time %d pv ",
| ~~~^
| |
| long long unsigned int
| %lu
1927 | (score > 0 ? mateValue - score + 1 : -mateValue - score) / 2,
1928 | nodes, nps, hash_full(), totalTime);
| ~~~~~
| |
| uint64_t {aka long unsigned int}
search.c:1930:46: warning: format ‘%llu’ expects argument of type ‘long long unsigned int’, but argument 3 has type ‘uint64_t’ {aka ‘long unsigned int’} [-Wformat=]
1930 | printf("score cp %d nodes %llu nps %llu hashfull %d time %d pv ",
| ~~~^
| |
| long long unsigned int
| %lu
1931 | score, nodes, nps, hash_full(), totalTime);
| ~~~~~
| |
| uint64_t {aka long unsigned int}
/tmp/ccpRlXkj.s: Assembler messages:
/tmp/ccpRlXkj.s: Fatal error: can't write 15 bytes to section .gnu.lto_.profile.2c3959db5ca81f54 of .tmp/search.o: 'No space left on device'
/tmp/ccpRlXkj.s: Fatal error: .tmp/search.o: No such file or directory
move.c:1650:1: fatal error: error writing to /tmp/cc5sJym3.s: No space left on device
1650 | }
| ^
compilation terminated.
make: *** [makefile:190: .tmp/search.o] Error 1
make: *** Waiting for unfinished jobs....
make: *** [makefile:190: .tmp/move.o] Error 1