mkdir obj
clang++ -std=c++20 -O3 -flto -Wall -march=native -c -o obj/accumulator.o source/accumulator.cpp
clang++ -std=c++20 -O3 -flto -Wall -march=native -c -o obj/benchmark.o source/benchmark.cpp
clang++ -std=c++20 -O3 -flto -Wall -march=native -c -o obj/bitboard.o source/bitboard.cpp
clang++ -std=c++20 -O3 -flto -Wall -march=native -c -o obj/board.o source/board.cpp
clang++ -std=c++20 -O3 -flto -Wall -march=native -c -o obj/datagen.o source/datagen.cpp
clang++ -std=c++20 -O3 -flto -Wall -march=native -c -o obj/main.o source/main.cpp
clang++ -std=c++20 -O3 -flto -Wall -march=native -c -o obj/movegen.o source/movegen.cpp
clang++ -std=c++20 -O3 -flto -Wall -march=native -c -o obj/nnue.o source/nnue.cpp
clang++ -std=c++20 -O3 -flto -Wall -march=native -c -o obj/perft.o source/perft.cpp
clang++ -std=c++20 -O3 -flto -Wall -march=native -c -o obj/search.o source/search.cpp
clang++ -std=c++20 -O3 -flto -Wall -march=native -c -o obj/tests.o source/tests.cpp
clang++ -std=c++20 -O3 -flto -Wall -march=native -c -o obj/tt.o source/tt.cpp
clang++ -std=c++20 -O3 -flto -Wall -march=native -c -o obj/uci.o source/uci.cpp
clang++ -std=c++20 -O3 -flto -Wall -march=native -c -o obj/utils.o source/utils.cpp
source/benchmark.cppsource/datagen.cppsource/tests.cpp:1::1:10::110:10 source/nnue.cppIn file included from In file included from In file included from In file included from source/uci.cppsource/accumulator.cpp::1source/board.cppIn file included from :1source/utils.cppIn file included from :In file included from 1source/movegen.cpp In file included from :source/search.cpp:1:1::In file included from 1 source/tt.cppsource/perft.cpp:10In file included from source/bitboard.cpp::source/main.cpp::111: 11fatal error: 'cstring' file not foundfatal error: fatal error: 'random' file not found
fatal error: 'iostream' file not found

'fstream' file not found
:
:
source\uci.h:In file included from source\tt.h:
:
source\board.h:
:
:
source\bitboard.h::
2In file included from :
:In file included from 2source\perft.h:2::
source\board.hIn file included from :source\search.h::2:
In file included from source\board.hsource\movegen.h:source\accumulator.h2:
2:source\board.h10::210:22::2:
::
 source\utils.h10fatal error: :
'array' file not found102source\bitboard.hsource\board.h:::2source\nnue.h:: :10fatal error: 'array' file not found
:10::: fatal error: 
:  fatal error: fatal error: 2'array' file not found:
 2:1010'array' file not foundfatal error: 
'iostream' file not found2
:::10 ::'atomic' file not found 
10: fatal error: 'iostream' file not foundfatal error: 
'cstdint' file not found fatal error: 'array' file not found
fatal error: 'vector' file not found

                        2        2        22    1    2    12    22 |  | #1i | n#2 |  |  |  | #cl | # | i## | iin# | iuncd2#iinnc# | ii##in | #n#ccilninnccllcuudlucelc <lde <1l | u#ide <eairoray>
luud u<ddeilnundacere rsen t dcr< c<an<raarenadmc>clsludes <li
yc      tlueu o      umo|          ^~~~~~~~~~
rtadye> 
<>v
es      |          ^~~~~~~~
      | udrdeie|  t<         ^~~~~~~iron >         ^~~~~~~dic<togr>><<
a
r      sd
e      | 
ra
y      n| t e         ^~~~~~~~fa>ms
<      a| 
r| >         ^~~~~~~t>rreaty>
      aa         ^~~~~~~~~m
>r
e|       | 
         ^~~~~~~~~~

         ^~~~~~~      

|          ^~~~~~~
         ^~~~~~~~~~
atom      |          ^~~~~~~~~
>
      | mic>
      |          ^~~~~~~~~         ^~~~~~~~

1 error generated.
1 error generated1.
 error generated.
1 error generated.
1 error generated.
1 error generated.
make: *** [Makefile:64: obj/accumulator.o] Error 1
make: *** Waiting for unfinished jobs....
make: *** [Makefile:64: obj/bitboard.o] Error 1
make: *** [Makefile:64: obj/perft.o] Error 1
make: *** [Makefile:64: obj/tt.o] Error 1
make: *** [Makefile:64: obj/utils.o] Error 1
make: *** [Makefile:64: obj/movegen.o] Error 1
1 error generated.
make: *** [Makefile:64: obj/board.o] Error 1
1 error generated.
1 error generated.
make: *** [Makefile:64: obj/benchmark.o] Error 1
1 error generated.
make: *** [Makefile:64: obj/tests.o] Error 1
1 error generated.
make: *** [Makefile:64: obj/uci.o] Error 1
make: *** [Makefile:64: obj/datagen.o] Error 1
1 error generated.
1 error generated.
make: *** [Makefile:64: obj/main.o] Error 1
make: *** [Makefile:64: obj/search.o] Error 1
1 error generated.
make: *** [Makefile:64: obj/nnue.o] Error 1