dotnet publish src/ChessEngine.csproj \
	-c Release \
	-f net8.0 \
	-r linux-x64 \
	--self-contained true \
	/p:PublishSingleFile=true \
	/p:IncludeNativeLibrariesForSelfExtract=true \
	-o build
  Determining projects to restore...
  Restored /tmp/tmpiq54lbl6/NoobyBot/NoobyBot-tmp/src/ChessEngine.csproj (in 417 ms).
/tmp/tmpiq54lbl6/NoobyBot/NoobyBot-tmp/src/AI/AIPlayer.cs(18,12): warning CS8618: Non-nullable field 'board' must contain a non-null value when exiting constructor. Consider adding the 'required' modifier or declaring the field as nullable. [/tmp/tmpiq54lbl6/NoobyBot/NoobyBot-tmp/src/ChessEngine.csproj]
/tmp/tmpiq54lbl6/NoobyBot/NoobyBot-tmp/src/AI/AIPlayer.cs(18,12): warning CS8618: Non-nullable field 'search' must contain a non-null value when exiting constructor. Consider adding the 'required' modifier or declaring the field as nullable. [/tmp/tmpiq54lbl6/NoobyBot/NoobyBot-tmp/src/ChessEngine.csproj]
/tmp/tmpiq54lbl6/NoobyBot/NoobyBot-tmp/src/AI/AIPlayer.cs(18,12): warning CS8618: Non-nullable field 'hardCapToken' must contain a non-null value when exiting constructor. Consider adding the 'required' modifier or declaring the field as nullable. [/tmp/tmpiq54lbl6/NoobyBot/NoobyBot-tmp/src/ChessEngine.csproj]
/tmp/tmpiq54lbl6/NoobyBot/NoobyBot-tmp/src/AI/AIPlayer.cs(18,12): warning CS8618: Non-nullable field 'softCapToken' must contain a non-null value when exiting constructor. Consider adding the 'required' modifier or declaring the field as nullable. [/tmp/tmpiq54lbl6/NoobyBot/NoobyBot-tmp/src/ChessEngine.csproj]
/tmp/tmpiq54lbl6/NoobyBot/NoobyBot-tmp/src/AI/Search.cs(56,12): warning CS8618: Non-nullable event 'onSearchComplete' must contain a non-null value when exiting constructor. Consider adding the 'required' modifier or declaring the event as nullable. [/tmp/tmpiq54lbl6/NoobyBot/NoobyBot-tmp/src/ChessEngine.csproj]
/tmp/tmpiq54lbl6/NoobyBot/NoobyBot-tmp/src/AI/TranspositionTable.cs(133,19): warning CS8625: Cannot convert null literal to non-nullable reference type. [/tmp/tmpiq54lbl6/NoobyBot/NoobyBot-tmp/src/ChessEngine.csproj]
/tmp/tmpiq54lbl6/NoobyBot/NoobyBot-tmp/src/Bot.cs(20,27): warning CS8600: Converting null literal or possible null value to non-nullable type. [/tmp/tmpiq54lbl6/NoobyBot/NoobyBot-tmp/src/ChessEngine.csproj]
/tmp/tmpiq54lbl6/NoobyBot/NoobyBot-tmp/src/Bot.cs(21,39): warning CS8604: Possible null reference argument for parameter 'command' in 'void Engine.ReceiveCommand(string command)'. [/tmp/tmpiq54lbl6/NoobyBot/NoobyBot-tmp/src/ChessEngine.csproj]
/tmp/tmpiq54lbl6/NoobyBot/NoobyBot-tmp/src/Core/Player.cs(6,37): warning CS8618: Non-nullable event 'onMoveChosen' must contain a non-null value when exiting constructor. Consider adding the 'required' modifier or declaring the event as nullable. [/tmp/tmpiq54lbl6/NoobyBot/NoobyBot-tmp/src/ChessEngine.csproj]
/tmp/tmpiq54lbl6/NoobyBot/NoobyBot-tmp/src/Tuning/Tuner.cs(54,12): warning CS8618: Non-nullable field 'entries' must contain a non-null value when exiting constructor. Consider adding the 'required' modifier or declaring the field as nullable. [/tmp/tmpiq54lbl6/NoobyBot/NoobyBot-tmp/src/ChessEngine.csproj]
/tmp/tmpiq54lbl6/NoobyBot/NoobyBot-tmp/src/Tuning/Tuner.cs(54,12): warning CS8618: Non-nullable field 'test' must contain a non-null value when exiting constructor. Consider adding the 'required' modifier or declaring the field as nullable. [/tmp/tmpiq54lbl6/NoobyBot/NoobyBot-tmp/src/ChessEngine.csproj]
/tmp/tmpiq54lbl6/NoobyBot/NoobyBot-tmp/src/Tuning/Tuner.cs(54,12): warning CS8618: Non-nullable field 'data' must contain a non-null value when exiting constructor. Consider adding the 'required' modifier or declaring the field as nullable. [/tmp/tmpiq54lbl6/NoobyBot/NoobyBot-tmp/src/ChessEngine.csproj]
/tmp/tmpiq54lbl6/NoobyBot/NoobyBot-tmp/src/Core/Board.cs(37,19): warning CS8618: Non-nullable field 'startFen' must contain a non-null value when exiting constructor. Consider adding the 'required' modifier or declaring the field as nullable. [/tmp/tmpiq54lbl6/NoobyBot/NoobyBot-tmp/src/ChessEngine.csproj]
/tmp/tmpiq54lbl6/NoobyBot/NoobyBot-tmp/src/Util/SearchTester.cs(15,12): warning CS8618: Non-nullable field 'search' must contain a non-null value when exiting constructor. Consider adding the 'required' modifier or declaring the field as nullable. [/tmp/tmpiq54lbl6/NoobyBot/NoobyBot-tmp/src/ChessEngine.csproj]
/tmp/tmpiq54lbl6/NoobyBot/NoobyBot-tmp/src/AI/Search.cs(20,9): warning CS0649: Field 'Search.bestEvalThisIteration' is never assigned to, and will always have its default value 0 [/tmp/tmpiq54lbl6/NoobyBot/NoobyBot-tmp/src/ChessEngine.csproj]
/tmp/tmpiq54lbl6/NoobyBot/NoobyBot-tmp/src/Util/SearchTester.cs(12,9): warning CS0169: The field 'SearchTester.currentTestNumber' is never used [/tmp/tmpiq54lbl6/NoobyBot/NoobyBot-tmp/src/ChessEngine.csproj]
/tmp/tmpiq54lbl6/NoobyBot/NoobyBot-tmp/src/Util/SearchTester.cs(13,10): warning CS0414: The field 'SearchTester.isTestRunning' is assigned but its value is never used [/tmp/tmpiq54lbl6/NoobyBot/NoobyBot-tmp/src/ChessEngine.csproj]
  ChessEngine -> /tmp/tmpiq54lbl6/NoobyBot/NoobyBot-tmp/src/bin/Release/net8.0/linux-x64/ChessEngine.dll
  Unable to access file during bundling. Retrying 3 more times...
/usr/share/dotnet/sdk/10.0.203/Sdks/Microsoft.NET.Sdk/targets/Microsoft.NET.Publish.targets(1228,5): error MSB4018: The "GenerateBundle" task failed unexpectedly. [/tmp/tmpiq54lbl6/NoobyBot/NoobyBot-tmp/src/ChessEngine.csproj]
/usr/share/dotnet/sdk/10.0.203/Sdks/Microsoft.NET.Sdk/targets/Microsoft.NET.Publish.targets(1228,5): error MSB4018: System.InvalidOperationException: It is forbidden to change Manifest state after it was written or BundleId was obtained. [/tmp/tmpiq54lbl6/NoobyBot/NoobyBot-tmp/src/ChessEngine.csproj]
/usr/share/dotnet/sdk/10.0.203/Sdks/Microsoft.NET.Sdk/targets/Microsoft.NET.Publish.targets(1228,5): error MSB4018:    at Microsoft.NET.HostModel.Bundle.Manifest.AddEntry(FileType type, FileStream fileContent, String relativePath, Int64 offset, Int64 compressedSize, UInt32 bundleMajorVersion) [/tmp/tmpiq54lbl6/NoobyBot/NoobyBot-tmp/src/ChessEngine.csproj]
/usr/share/dotnet/sdk/10.0.203/Sdks/Microsoft.NET.Sdk/targets/Microsoft.NET.Publish.targets(1228,5): error MSB4018:    at Microsoft.NET.HostModel.Bundle.Bundler.GenerateBundle(IReadOnlyList`1 fileSpecs) [/tmp/tmpiq54lbl6/NoobyBot/NoobyBot-tmp/src/ChessEngine.csproj]
/usr/share/dotnet/sdk/10.0.203/Sdks/Microsoft.NET.Sdk/targets/Microsoft.NET.Publish.targets(1228,5): error MSB4018:    at Microsoft.NET.Build.Tasks.GenerateBundle.<>c__DisplayClass56_0.<ExecuteWithRetry>b__0() [/tmp/tmpiq54lbl6/NoobyBot/NoobyBot-tmp/src/ChessEngine.csproj]
/usr/share/dotnet/sdk/10.0.203/Sdks/Microsoft.NET.Sdk/targets/Microsoft.NET.Publish.targets(1228,5): error MSB4018:    at Microsoft.NET.Build.Tasks.GenerateBundle.DoWithRetry(Action action) [/tmp/tmpiq54lbl6/NoobyBot/NoobyBot-tmp/src/ChessEngine.csproj]
/usr/share/dotnet/sdk/10.0.203/Sdks/Microsoft.NET.Sdk/targets/Microsoft.NET.Publish.targets(1228,5): error MSB4018:    at Microsoft.NET.Build.Tasks.GenerateBundle.ExecuteWithRetry() [/tmp/tmpiq54lbl6/NoobyBot/NoobyBot-tmp/src/ChessEngine.csproj]
/usr/share/dotnet/sdk/10.0.203/Sdks/Microsoft.NET.Sdk/targets/Microsoft.NET.Publish.targets(1228,5): error MSB4018:    at Microsoft.NET.Build.Tasks.GenerateBundle.ExecuteCore() [/tmp/tmpiq54lbl6/NoobyBot/NoobyBot-tmp/src/ChessEngine.csproj]
/usr/share/dotnet/sdk/10.0.203/Sdks/Microsoft.NET.Sdk/targets/Microsoft.NET.Publish.targets(1228,5): error MSB4018:    at Microsoft.NET.Build.Tasks.TaskBase.Execute() [/tmp/tmpiq54lbl6/NoobyBot/NoobyBot-tmp/src/ChessEngine.csproj]
/usr/share/dotnet/sdk/10.0.203/Sdks/Microsoft.NET.Sdk/targets/Microsoft.NET.Publish.targets(1228,5): error MSB4018:    at Microsoft.Build.BackEnd.TaskExecutionHost.Execute() [/tmp/tmpiq54lbl6/NoobyBot/NoobyBot-tmp/src/ChessEngine.csproj]
/usr/share/dotnet/sdk/10.0.203/Sdks/Microsoft.NET.Sdk/targets/Microsoft.NET.Publish.targets(1228,5): error MSB4018:    at Microsoft.Build.BackEnd.TaskBuilder.ExecuteInstantiatedTask(TaskExecutionHost taskExecutionHost, TaskLoggingContext taskLoggingContext, TaskHost taskHost, ItemBucket bucket, TaskExecutionMode howToExecuteTask) [/tmp/tmpiq54lbl6/NoobyBot/NoobyBot-tmp/src/ChessEngine.csproj]
make: *** [Makefile:32: all] Error 1