clang: error: the clang compiler does not support '-march=native'
clang: error: the clang compiler does not support '-march=native'
clang: error: the clang compiler does not support '-march=native'
clang: error: the clang compiler does not support '-march=native'
make[1]: Entering directory '/tmp/tmp1oj05d_2/Potential/Potential-tmp/src'
clang: error: the clang compiler does not support '-march=native'
clang: error: the clang compiler does not support '-march=native'
clang: error: the clang compiler does not support '-march=native'
clang: error: the clang compiler does not support '-march=native'
make[1]: Leaving directory '/tmp/tmp1oj05d_2/Potential/Potential-tmp/src'
make[1]: Entering directory '/tmp/tmp1oj05d_2/Potential/Potential-tmp/src'
clang: error: the clang compiler does not support '-march=native'
clang: error: the clang compiler does not support '-march=native'
clang: error: the clang compiler does not support '-march=native'
clang: error: the clang compiler does not support '-march=native'
mkdir -p ".tmp" ".tmp/Source"
clang -funroll-loops -fomit-frame-pointer -O3 -flto -fno-exceptions -DIS_64BIT -DNDEBUG -Wall -Wextra -Wno-unused-variable -DCOMMIT_SHA=unknown -funroll-loops -O3 -flto -fno-exceptions -DIS_64BIT -DNDEBUG -fprofile-instr-generate -march=native -MMD -MP -c bench.c -o .tmp/bench.o -pthread -lm
clang -funroll-loops -fomit-frame-pointer -O3 -flto -fno-exceptions -DIS_64BIT -DNDEBUG -Wall -Wextra -Wno-unused-variable -DCOMMIT_SHA=unknown -funroll-loops -O3 -flto -fno-exceptions -DIS_64BIT -DNDEBUG -fprofile-instr-generate -march=native -MMD -MP -c bit_manipulation.c -o .tmp/bit_manipulation.o -pthread -lm
clang -funroll-loops -fomit-frame-pointer -O3 -flto -fno-exceptions -DIS_64BIT -DNDEBUG -Wall -Wextra -Wno-unused-variable -DCOMMIT_SHA=unknown -funroll-loops -O3 -flto -fno-exceptions -DIS_64BIT -DNDEBUG -fprofile-instr-generate -march=native -MMD -MP -c board_constants.c -o .tmp/board_constants.o -pthread -lm
clang -funroll-loops -fomit-frame-pointer -O3 -flto -fno-exceptions -DIS_64BIT -DNDEBUG -Wall -Wextra -Wno-unused-variable -DCOMMIT_SHA=unknown -funroll-loops -O3 -flto -fno-exceptions -DIS_64BIT -DNDEBUG -fprofile-instr-generate -march=native -MMD -MP -c datagen.c -o .tmp/datagen.o -pthread -lm
clang -funroll-loops -fomit-frame-pointer -O3 -flto -fno-exceptions -DIS_64BIT -DNDEBUG -Wall -Wextra -Wno-unused-variable -DCOMMIT_SHA=unknown -funroll-loops -O3 -flto -fno-exceptions -DIS_64BIT -DNDEBUG -fprofile-instr-generate -march=native -MMD -MP -c evaluation.c -o .tmp/evaluation.o -pthread -lm
clang -funroll-loops -fomit-frame-pointer -O3 -flto -fno-exceptions -DIS_64BIT -DNDEBUG -Wall -Wextra -Wno-unused-variable -DCOMMIT_SHA=unknown -funroll-loops -O3 -flto -fno-exceptions -DIS_64BIT -DNDEBUG -fprofile-instr-generate -march=native -MMD -MP -c fen.c -o .tmp/fen.o -pthread -lm
clang -funroll-loops -fomit-frame-pointer -O3 -flto -fno-exceptions -DIS_64BIT -DNDEBUG -Wall -Wextra -Wno-unused-variable -DCOMMIT_SHA=unknown -funroll-loops -O3 -flto -fno-exceptions -DIS_64BIT -DNDEBUG -fprofile-instr-generate -march=native -MMD -MP -c generate_fen.c -o .tmp/generate_fen.o -pthread -lm
clang -funroll-loops -fomit-frame-pointer -O3 -flto -fno-exceptions -DIS_64BIT -DNDEBUG -Wall -Wextra -Wno-unused-variable -DCOMMIT_SHA=unknown -funroll-loops -O3 -flto -fno-exceptions -DIS_64BIT -DNDEBUG -fprofile-instr-generate -march=native -MMD -MP -c history.c -o .tmp/history.o -pthread -lm
clang -funroll-loops -fomit-frame-pointer -O3 -flto -fno-exceptions -DIS_64BIT -DNDEBUG -Wall -Wextra -Wno-unused-variable -DCOMMIT_SHA=unknown -funroll-loops -O3 -flto -fno-exceptions -DIS_64BIT -DNDEBUG -fprofile-instr-generate -march=native -MMD -MP -c magic.c -o .tmp/magic.o -pthread -lm
clang -funroll-loops -fomit-frame-pointer -O3 -flto -fno-exceptions -DIS_64BIT -DNDEBUG -Wall -Wextra -Wno-unused-variable -DCOMMIT_SHA=unknown -funroll-loops -O3 -flto -fno-exceptions -DIS_64BIT -DNDEBUG -fprofile-instr-generate -march=native -MMD -MP -c mask.c -o .tmp/mask.o -pthread -lm
clangclangclangclang: : : clang: warning: warning: warning: -lm: 'linker' input unused [-Wunused-command-line-argument]-lm: 'linker' input unused [-Wunused-command-line-argument]warning: 

-lm: 'linker' input unused [-Wunused-command-line-argument]-lm: 'linker' input unused [-Wunused-command-line-argument]

clang: warning: -lm: 'linker' input unused [-Wunused-command-line-argument]
clangclang: error: the clang compiler does not support '-march=native'clang
clang: : error: error: the clang compiler does not support '-march=native'the clang compiler does not support '-march=native'

: error: clang: error: the clang compiler does not support '-march=native'
the clang compiler does not support '-march=native'
clang: warning: -lm: 'linker' input unused [-Wunused-command-line-argument]
clang: error: the clang compiler does not support '-march=native'
clang: warning: -lm: 'linker' input unused [-Wunused-command-line-argument]
clang: error: the clang compiler does not support '-march=native'
: warning: -lm: 'linker' input unused [-Wunused-command-line-argument]
clang: error: the clang compiler does not support '-march=native'
make[1]: *** [makefile:191: .tmp/bit_manipulation.o] Error 1
make[1]: *** Waiting for unfinished jobs....
make[1]: *** [makefile:191: .tmp/datagen.o] Error 1
make[1]: *** [makefile:191: .tmp/evaluation.o] Error 1
make[1]: *** [makefile:191: .tmp/generate_fen.o] Error 1
make[1]: *** [makefile:191: .tmp/history.o] Error 1
make[1]: *** [makefile:191: .tmp/fen.o] Error 1
make[1]: *** [makefile:191: .tmp/magic.o] Error 1
clang: warning: -lm: 'linker' input unused [-Wunused-command-line-argument]
clang: error: the clang compiler does not support '-march=native'
make[1]: *** [makefile:191: .tmp/board_constants.o] Error 1
make[1]: *** [makefile:191: .tmp/bench.o] Error 1
clang: warning: -lm: 'linker' input unused [-Wunused-command-line-argument]
clang: error: the clang compiler does not support '-march=native'
make[1]: *** [makefile:191: .tmp/mask.o] Error 1
make[1]: Leaving directory '/tmp/tmp1oj05d_2/Potential/Potential-tmp/src'
make: *** [makefile:210: pgo] Error 2