make[1]: Entering directory '/tmp/tmp7g12n87b/Potential/Potential-tmp/src'
make[1]: Leaving directory '/tmp/tmp7g12n87b/Potential/Potential-tmp/src'
make[1]: Entering directory '/tmp/tmp7g12n87b/Potential/Potential-tmp/src'
mkdir -p ".tmp" ".tmp/Source"
Downloading beans.bin...
clang -funroll-loops -fomit-frame-pointer -O3 -flto -fno-exceptions -DIS_64BIT -DNDEBUG -Wall -Wextra -Wno-unused-variable -DCOMMIT_SHA=unknown -funroll-loops -O3 -flto -fno-exceptions -DIS_64BIT -DNDEBUG -DUSE_AVX2 -DUSE_SIMD -mavx2 -mbmi -mbmi2 -fprofile-instr-generate -march=native -MMD -MP -c bench.c -o .tmp/bench.o -pthread -lm
clang -funroll-loops -fomit-frame-pointer -O3 -flto -fno-exceptions -DIS_64BIT -DNDEBUG -Wall -Wextra -Wno-unused-variable -DCOMMIT_SHA=unknown -funroll-loops -O3 -flto -fno-exceptions -DIS_64BIT -DNDEBUG -DUSE_AVX2 -DUSE_SIMD -mavx2 -mbmi -mbmi2 -fprofile-instr-generate -march=native -MMD -MP -c bit_manipulation.c -o .tmp/bit_manipulation.o -pthread -lm
clang -funroll-loops -fomit-frame-pointer -O3 -flto -fno-exceptions -DIS_64BIT -DNDEBUG -Wall -Wextra -Wno-unused-variable -DCOMMIT_SHA=unknown -funroll-loops -O3 -flto -fno-exceptions -DIS_64BIT -DNDEBUG -DUSE_AVX2 -DUSE_SIMD -mavx2 -mbmi -mbmi2 -fprofile-instr-generate -march=native -MMD -MP -c board_constants.c -o .tmp/board_constants.o -pthread -lm
clang -funroll-loops -fomit-frame-pointer -O3 -flto -fno-exceptions -DIS_64BIT -DNDEBUG -Wall -Wextra -Wno-unused-variable -DCOMMIT_SHA=unknown -funroll-loops -O3 -flto -fno-exceptions -DIS_64BIT -DNDEBUG -DUSE_AVX2 -DUSE_SIMD -mavx2 -mbmi -mbmi2 -fprofile-instr-generate -march=native -MMD -MP -c datagen.c -o .tmp/datagen.o -pthread -lm
clang -funroll-loops -fomit-frame-pointer -O3 -flto -fno-exceptions -DIS_64BIT -DNDEBUG -Wall -Wextra -Wno-unused-variable -DCOMMIT_SHA=unknown -funroll-loops -O3 -flto -fno-exceptions -DIS_64BIT -DNDEBUG -DUSE_AVX2 -DUSE_SIMD -mavx2 -mbmi -mbmi2 -fprofile-instr-generate -march=native -MMD -MP -c evaluation.c -o .tmp/evaluation.o -pthread -lm
clang -funroll-loops -fomit-frame-pointer -O3 -flto -fno-exceptions -DIS_64BIT -DNDEBUG -Wall -Wextra -Wno-unused-variable -DCOMMIT_SHA=unknown -funroll-loops -O3 -flto -fno-exceptions -DIS_64BIT -DNDEBUG -DUSE_AVX2 -DUSE_SIMD -mavx2 -mbmi -mbmi2 -fprofile-instr-generate -march=native -MMD -MP -c fen.c -o .tmp/fen.o -pthread -lm
clang -funroll-loops -fomit-frame-pointer -O3 -flto -fno-exceptions -DIS_64BIT -DNDEBUG -Wall -Wextra -Wno-unused-variable -DCOMMIT_SHA=unknown -funroll-loops -O3 -flto -fno-exceptions -DIS_64BIT -DNDEBUG -DUSE_AVX2 -DUSE_SIMD -mavx2 -mbmi -mbmi2 -fprofile-instr-generate -march=native -MMD -MP -c generate_fen.c -o .tmp/generate_fen.o -pthread -lm
clang -funroll-loops -fomit-frame-pointer -O3 -flto -fno-exceptions -DIS_64BIT -DNDEBUG -Wall -Wextra -Wno-unused-variable -DCOMMIT_SHA=unknown -funroll-loops -O3 -flto -fno-exceptions -DIS_64BIT -DNDEBUG -DUSE_AVX2 -DUSE_SIMD -mavx2 -mbmi -mbmi2 -fprofile-instr-generate -march=native -MMD -MP -c history.c -o .tmp/history.o -pthread -lm
clang -funroll-loops -fomit-frame-pointer -O3 -flto -fno-exceptions -DIS_64BIT -DNDEBUG -Wall -Wextra -Wno-unused-variable -DCOMMIT_SHA=unknown -funroll-loops -O3 -flto -fno-exceptions -DIS_64BIT -DNDEBUG -DUSE_AVX2 -DUSE_SIMD -mavx2 -mbmi -mbmi2 -fprofile-instr-generate -march=native -MMD -MP -c magic.c -o .tmp/magic.o -pthread -lm
clang -funroll-loops -fomit-frame-pointer -O3 -flto -fno-exceptions -DIS_64BIT -DNDEBUG -Wall -Wextra -Wno-unused-variable -DCOMMIT_SHA=unknown -funroll-loops -O3 -flto -fno-exceptions -DIS_64BIT -DNDEBUG -DUSE_AVX2 -DUSE_SIMD -mavx2 -mbmi -mbmi2 -fprofile-instr-generate -march=native -MMD -MP -c mask.c -o .tmp/mask.o -pthread -lm
clang -funroll-loops -fomit-frame-pointer -O3 -flto -fno-exceptions -DIS_64BIT -DNDEBUG -Wall -Wextra -Wno-unused-variable -DCOMMIT_SHA=unknown -funroll-loops -O3 -flto -fno-exceptions -DIS_64BIT -DNDEBUG -DUSE_AVX2 -DUSE_SIMD -mavx2 -mbmi -mbmi2 -fprofile-instr-generate -march=native -MMD -MP -c move.c -o .tmp/move.o -pthread -lm
clang -funroll-loops -fomit-frame-pointer -O3 -flto -fno-exceptions -DIS_64BIT -DNDEBUG -Wall -Wextra -Wno-unused-variable -DCOMMIT_SHA=unknown -funroll-loops -O3 -flto -fno-exceptions -DIS_64BIT -DNDEBUG -DUSE_AVX2 -DUSE_SIMD -mavx2 -mbmi -mbmi2 -fprofile-instr-generate -march=native -MMD -MP -c movepicker.c -o .tmp/movepicker.o -pthread -lm
clang -funroll-loops -fomit-frame-pointer -O3 -flto -fno-exceptions -DIS_64BIT -DNDEBUG -Wall -Wextra -Wno-unused-variable -DCOMMIT_SHA=unknown -funroll-loops -O3 -flto -fno-exceptions -DIS_64BIT -DNDEBUG -DUSE_AVX2 -DUSE_SIMD -mavx2 -mbmi -mbmi2 -fprofile-instr-generate -march=native -MMD -MP -c nnue.c -o .tmp/nnue.o -pthread -lm
clang -funroll-loops -fomit-frame-pointer -O3 -flto -fno-exceptions -DIS_64BIT -DNDEBUG -Wall -Wextra -Wno-unused-variable -DCOMMIT_SHA=unknown -funroll-loops -O3 -flto -fno-exceptions -DIS_64BIT -DNDEBUG -DUSE_AVX2 -DUSE_SIMD -mavx2 -mbmi -mbmi2 -fprofile-instr-generate -march=native -MMD -MP -c perft.c -o .tmp/perft.o -pthread -lm
clang -funroll-loops -fomit-frame-pointer -O3 -flto -fno-exceptions -DIS_64BIT -DNDEBUG -Wall -Wextra -Wno-unused-variable -DCOMMIT_SHA=unknown -funroll-loops -O3 -flto -fno-exceptions -DIS_64BIT -DNDEBUG -DUSE_AVX2 -DUSE_SIMD -mavx2 -mbmi -mbmi2 -fprofile-instr-generate -march=native -MMD -MP -c potential.c -o .tmp/potential.o -pthread -lm
clang -funroll-loops -fomit-frame-pointer -O3 -flto -fno-exceptions -DIS_64BIT -DNDEBUG -Wall -Wextra -Wno-unused-variable -DCOMMIT_SHA=unknown -funroll-loops -O3 -flto -fno-exceptions -DIS_64BIT -DNDEBUG -DUSE_AVX2 -DUSE_SIMD -mavx2 -mbmi -mbmi2 -fprofile-instr-generate -march=native -MMD -MP -c search.c -o .tmp/search.o -pthread -lm
clang -funroll-loops -fomit-frame-pointer -O3 -flto -fno-exceptions -DIS_64BIT -DNDEBUG -Wall -Wextra -Wno-unused-variable -DCOMMIT_SHA=unknown -funroll-loops -O3 -flto -fno-exceptions -DIS_64BIT -DNDEBUG -DUSE_AVX2 -DUSE_SIMD -mavx2 -mbmi -mbmi2 -fprofile-instr-generate -march=native -MMD -MP -c see.c -o .tmp/see.o -pthread -lm
clang -funroll-loops -fomit-frame-pointer -O3 -flto -fno-exceptions -DIS_64BIT -DNDEBUG -Wall -Wextra -Wno-unused-variable -DCOMMIT_SHA=unknown -funroll-loops -O3 -flto -fno-exceptions -DIS_64BIT -DNDEBUG -DUSE_AVX2 -DUSE_SIMD -mavx2 -mbmi -mbmi2 -fprofile-instr-generate -march=native -MMD -MP -c spsa.c -o .tmp/spsa.o -pthread -lm
clangclang: warning: -lm: 'linker' input unused [-Wunused-command-line-argument]
clang: warning: -lm: 'linker' input unused [-Wunused-command-line-argument]
: warning: -lm: 'linker' input unused [-Wunused-command-line-argument]
clang: warning: -lm: 'linker' input unused [-Wunused-command-line-argument]
clang: warning: -lm: 'linker' input unused [-Wunused-command-line-argument]
clang: warning: -lm: 'linker' input unused [-Wunused-command-line-argument]
clang -funroll-loops -fomit-frame-pointer -O3 -flto -fno-exceptions -DIS_64BIT -DNDEBUG -Wall -Wextra -Wno-unused-variable -DCOMMIT_SHA=unknown -funroll-loops -O3 -flto -fno-exceptions -DIS_64BIT -DNDEBUG -DUSE_AVX2 -DUSE_SIMD -mavx2 -mbmi -mbmi2 -fprofile-instr-generate -march=native -MMD -MP -c table.c -o .tmp/table.o -pthread -lm
clangclang: warning: -lm: 'linker' input unused [-Wunused-command-line-argument]
clang -funroll-loops -fomit-frame-pointer -O3 -flto -fno-exceptions -DIS_64BIT -DNDEBUG -Wall -Wextra -Wno-unused-variable -DCOMMIT_SHA=unknown -funroll-loops -O3 -flto -fno-exceptions -DIS_64BIT -DNDEBUG -DUSE_AVX2 -DUSE_SIMD -mavx2 -mbmi -mbmi2 -fprofile-instr-generate -march=native -MMD -MP -c threads.c -o .tmp/threads.o -pthread -lm
clang: warning: -lm: 'linker' input unused [-Wunused-command-line-argument]
: warning: -lm: 'linker' input unused [-Wunused-command-line-argument]
clang: warning: -lm: 'linker' input unused [-Wunused-command-line-argument]
clang: warning: -lm: 'linker' input unused [-Wunused-command-line-argument]
clang -funroll-loops -fomit-frame-pointer -O3 -flto -fno-exceptions -DIS_64BIT -DNDEBUG -Wall -Wextra -Wno-unused-variable -DCOMMIT_SHA=unknown -funroll-loops -O3 -flto -fno-exceptions -DIS_64BIT -DNDEBUG -DUSE_AVX2 -DUSE_SIMD -mavx2 -mbmi -mbmi2 -fprofile-instr-generate -march=native -MMD -MP -c timeman.c -o .tmp/timeman.o -pthread -lm
clang: warning: -lm: 'linker' input unused [-Wunused-command-line-argument]
clang -funroll-loops -fomit-frame-pointer -O3 -flto -fno-exceptions -DIS_64BIT -DNDEBUG -Wall -Wextra -Wno-unused-variable -DCOMMIT_SHA=unknown -funroll-loops -O3 -flto -fno-exceptions -DIS_64BIT -DNDEBUG -DUSE_AVX2 -DUSE_SIMD -mavx2 -mbmi -mbmi2 -fprofile-instr-generate -march=native -MMD -MP -c uci.c -o .tmp/uci.o -pthread -lm
clang -funroll-loops -fomit-frame-pointer -O3 -flto -fno-exceptions -DIS_64BIT -DNDEBUG -Wall -Wextra -Wno-unused-variable -DCOMMIT_SHA=unknown -funroll-loops -O3 -flto -fno-exceptions -DIS_64BIT -DNDEBUG -DUSE_AVX2 -DUSE_SIMD -mavx2 -mbmi -mbmi2 -fprofile-instr-generate -march=native -MMD -MP -c utils.c -o .tmp/utils.o -pthread -lm
clang: warning: -lm: 'linker' input unused [-Wunused-command-line-argument]
clang: warning: -lm: 'linker' input unused [-Wunused-command-line-argument]
clang: warning: -lm: 'linker' input unused [-Wunused-command-line-argument]
clang: warning: -lm: 'linker' input unused [-Wunused-command-line-argument]
clangclang: warning: -lm: 'linker' input unused [-Wunused-command-line-argument]
: warning: -lm: 'linker' input unused [-Wunused-command-line-argument]
clang: warning: -lm: 'linker' input unused [-Wunused-command-line-argument]
clang: warning: -lm: 'linker' input unused [-Wunused-command-line-argument]
clang: warning: -lm: 'linker' input unused [-Wunused-command-line-argument]
clang: warning: -lm: 'linker' input unused [-Wunused-command-line-argument]
clang: warning: -lm: 'linker' input unused [-Wunused-command-line-argument]
Downloaded beans.bin.
uci.c:713:17: error: call to undeclared function 'nnue_load'; ISO C99 and later do not support implicit function declarations [-Wimplicit-function-declaration]
  713 |             if (nnue_load(evalFile)) {
      |                 ^
1 error generated.
make[1]: *** [makefile:200: .tmp/uci.o] Error 1
make[1]: *** Waiting for unfinished jobs....
make[1]: Leaving directory '/tmp/tmp7g12n87b/Potential/Potential-tmp/src'
make: *** [makefile:228: pgo] Error 2