mkdir obj
clang++ -std=c++20 -c -o obj/accumulator.o source/accumulator.cpp -O3 -march=native -flto -static
clang++ -std=c++20 -c -o obj/benchmark.o source/benchmark.cpp -O3 -march=native -flto -static
clang++ -std=c++20 -c -o obj/bitboard.o source/bitboard.cpp -O3 -march=native -flto -static
clang++ -std=c++20 -c -o obj/board.o source/board.cpp -O3 -march=native -flto -static
clang++ -std=c++20 -c -o obj/datagen.o source/datagen.cpp -O3 -march=native -flto -static
clang++ -std=c++20 -c -o obj/evaluate.o source/evaluate.cpp -O3 -march=native -flto -static
clang++ -std=c++20 -c -o obj/main.o source/main.cpp -O3 -march=native -flto -static
clang++ -std=c++20 -c -o obj/movegen.o source/movegen.cpp -O3 -march=native -flto -static
clang++ -std=c++20 -c -o obj/nnue.o source/nnue.cpp -O3 -march=native -flto -static
clang++ -std=c++20 -c -o obj/perft.o source/perft.cpp -O3 -march=native -flto -static
source/benchmark.cpp:1:10: fatal error: 'cstring' file not found
    1 | #include <cstring>
      |          ^~~~~~~~~
clang++ -std=c++20 -c -o obj/search.o source/search.cpp -O3 -march=native -flto -static
clang++ -std=c++20 -c -o obj/tt.o source/tt.cpp -O3 -march=native -flto -static
clang++ -std=c++20 -c -o obj/uci.o source/uci.cpp -O3 -march=native -flto -static
In file included from source/accumulator.cpp:1:
In file included from source\accumulator.h:2:
source\nnue.h:2:10: fatal error: 'cstdint' file not found
    2 | #include <cstdint>
      |          ^~~~~~~~~
clang++ -std=c++20 -c -o obj/utils.o source/utils.cpp -O3 -march=native -flto -static
In file included from source/bitboard.cpp:1:
source\bitboard.h:2:10: fatal error: 'iostream' file not found
    2 | #include <iostream>
      |          ^~~~~~~~~~
1 error generated.
In file included from source/board.cpp:1:
source\board.h:2:10: fatal error: 'array' file not found
    2 | #include <array>
      |          ^~~~~~~
make: *** [Makefile:33: obj/bitboard.o] Error 1
make: *** Waiting for unfinished jobs....
In file included from source/main.cpp:1:
source\board.h:2:10: fatal error: 'array' file not found
    2 | #include <array>
      |          ^~~~~~~
In file included from source/evaluate.cpp:1:
In file included from source\evaluate.h:2:
source\board.h:2:10: fatal error: 'array' file not found
    2 | #include <array>
      |          ^~~~~~~
source/datagen.cpp:1:10: fatal error: 'random' file not found
    1 | #include <random>
      |          ^~~~~~~~
In file included from source/nnue.cpp:1:
In file included from C:\Program Files\LLVM\lib\clang\20\include\immintrin.h:24:
In file included from C:\Program Files\LLVM\lib\clang\20\include\xmmintrin.h:31:
In file included from C:\Program Files\LLVM\lib\clang\20\include\mm_malloc.h:13:
In file included from C:\Program Files (x86)\Windows Kits\10\Include\10.0.26100.0\ucrt\stdlib.h:12:
C:\Program Files (x86)\Windows Kits\10\Include\10.0.26100.0\ucrt\corecrt.h:10:10: fatal error: 'vcruntime.h' file not found
   10 | #include <vcruntime.h>
      |          ^~~~~~~~~~~~~
In file included from source/movegen.cpp:1:
In file included from source\movegen.h:2:
source\bitboard.h:2:10: fatal error: 'iostream' file not found
    2 | #include <iostream>
      |          ^~~~~~~~~~
1 error generated.
In file included from source/search.cpp:1:
In file included from source\search.h:2:
source\board.h:2:10: fatal error: 'array' file not found
    2 | #include <array>
      |          ^~~~~~~
1 error generated.
In file included from source/perft.cpp:1:
In file included from source\perft.h:2:
source\board.h:2:10: fatal error: 'array' file not found
    2 | #include <array>
      |          ^~~~~~~
make: *** [Makefile:33: obj/accumulator.o] Error 1
1 error generated.
In file included from source/tt.cpp:1:
In file included from source\tt.h:2:
source\board.h:2:10: fatal error: 'array' file not found
    2 | #include <array>
      |          ^~~~~~~
In file included from source/utils.cpp:1:
source\utils.h:2:10: fatal error: 'vector' file not found
    2 | #include <vector>
      |          ^~~~~~~~
In file included from source/uci.cpp:1:
In file included from source\uci.h:2:
source\move.h:2:10: fatal error: 'array' file not found
    2 | #include <array>
      |          ^~~~~~~
make: *** [Makefile:33: obj/evaluate.o] Error 1
1 error generated.
make: *** [Makefile:33: obj/board.o] Error 1
1 error generated.
make: *** [Makefile:33: obj/benchmark.o] Error 1
make: *** [Makefile:33: obj/main.o] Error 1
1 error generated.
make: *** [Makefile:33: obj/movegen.o] Error 1
1 error generated.
make: *** [Makefile:33: obj/nnue.o] Error 1
1 error generated.
make: *** [Makefile:33: obj/search.o] Error 1
1 error generated.
make: *** [Makefile:33: obj/uci.o] Error 1
1 error generated.
make: *** [Makefile:33: obj/perft.o] Error 1
1 error generated.
make: *** [Makefile:33: obj/tt.o] Error 1
1 error generated.
1 error generated.
make: *** [Makefile:33: obj/utils.o] Error 1
make: *** [Makefile:33: obj/datagen.o] Error 1