gcc -funroll-loops -fomit-frame-pointer -O3 -flto -fno-exceptions -DIS_64BIT -DNDEBUG -Wall -Wextra -Wno-unused-variable -DUSE_NEON -flax-vector-conversions -march=native -MMD -MP -c bench.c -o .tmp/bench.o -pthread -lm 
gcc -funroll-loops -fomit-frame-pointer -O3 -flto -fno-exceptions -DIS_64BIT -DNDEBUG -Wall -Wextra -Wno-unused-variable -DUSE_NEON -flax-vector-conversions -march=native -MMD -MP -c bit_manipulation.c -o .tmp/bit_manipulation.o -pthread -lm 
gcc -funroll-loops -fomit-frame-pointer -O3 -flto -fno-exceptions -DIS_64BIT -DNDEBUG -Wall -Wextra -Wno-unused-variable -DUSE_NEON -flax-vector-conversions -march=native -MMD -MP -c board_constants.c -o .tmp/board_constants.o -pthread -lm 
gcc -funroll-loops -fomit-frame-pointer -O3 -flto -fno-exceptions -DIS_64BIT -DNDEBUG -Wall -Wextra -Wno-unused-variable -DUSE_NEON -flax-vector-conversions -march=native -MMD -MP -c evaluation.c -o .tmp/evaluation.o -pthread -lm 
gcc -funroll-loops -fomit-frame-pointer -O3 -flto -fno-exceptions -DIS_64BIT -DNDEBUG -Wall -Wextra -Wno-unused-variable -DUSE_NEON -flax-vector-conversions -march=native -MMD -MP -c fen.c -o .tmp/fen.o -pthread -lm 
gcc -funroll-loops -fomit-frame-pointer -O3 -flto -fno-exceptions -DIS_64BIT -DNDEBUG -Wall -Wextra -Wno-unused-variable -DUSE_NEON -flax-vector-conversions -march=native -MMD -MP -c history.c -o .tmp/history.o -pthread -lm 
gcc -funroll-loops -fomit-frame-pointer -O3 -flto -fno-exceptions -DIS_64BIT -DNDEBUG -Wall -Wextra -Wno-unused-variable -DUSE_NEON -flax-vector-conversions -march=native -MMD -MP -c magic.c -o .tmp/magic.o -pthread -lm 
gcc -funroll-loops -fomit-frame-pointer -O3 -flto -fno-exceptions -DIS_64BIT -DNDEBUG -Wall -Wextra -Wno-unused-variable -DUSE_NEON -flax-vector-conversions -march=native -MMD -MP -c mask.c -o .tmp/mask.o -pthread -lm 
gcc -funroll-loops -fomit-frame-pointer -O3 -flto -fno-exceptions -DIS_64BIT -DNDEBUG -Wall -Wextra -Wno-unused-variable -DUSE_NEON -flax-vector-conversions -march=native -MMD -MP -c move.c -o .tmp/move.o -pthread -lm 
gcc -funroll-loops -fomit-frame-pointer -O3 -flto -fno-exceptions -DIS_64BIT -DNDEBUG -Wall -Wextra -Wno-unused-variable -DUSE_NEON -flax-vector-conversions -march=native -MMD -MP -c perft.c -o .tmp/perft.o -pthread -lm 
gcc -funroll-loops -fomit-frame-pointer -O3 -flto -fno-exceptions -DIS_64BIT -DNDEBUG -Wall -Wextra -Wno-unused-variable -DUSE_NEON -flax-vector-conversions -march=native -MMD -MP -c potential.c -o .tmp/potential.o -pthread -lm 
gcc -funroll-loops -fomit-frame-pointer -O3 -flto -fno-exceptions -DIS_64BIT -DNDEBUG -Wall -Wextra -Wno-unused-variable -DUSE_NEON -flax-vector-conversions -march=native -MMD -MP -c search.c -o .tmp/search.o -pthread -lm 
gcc -funroll-loops -fomit-frame-pointer -O3 -flto -fno-exceptions -DIS_64BIT -DNDEBUG -Wall -Wextra -Wno-unused-variable -DUSE_NEON -flax-vector-conversions -march=native -MMD -MP -c see.c -o .tmp/see.o -pthread -lm 
gcc -funroll-loops -fomit-frame-pointer -O3 -flto -fno-exceptions -DIS_64BIT -DNDEBUG -Wall -Wextra -Wno-unused-variable -DUSE_NEON -flax-vector-conversions -march=native -MMD -MP -c table.c -o .tmp/table.o -pthread -lm 
gcc -funroll-loops -fomit-frame-pointer -O3 -flto -fno-exceptions -DIS_64BIT -DNDEBUG -Wall -Wextra -Wno-unused-variable -DUSE_NEON -flax-vector-conversions -march=native -MMD -MP -c uci.c -o .tmp/uci.o -pthread -lm 
gcc -funroll-loops -fomit-frame-pointer -O3 -flto -fno-exceptions -DIS_64BIT -DNDEBUG -Wall -Wextra -Wno-unused-variable -DUSE_NEON -flax-vector-conversions -march=native -MMD -MP -c utils.c -o .tmp/utils.o -pthread -lm 
gcc -funroll-loops -fomit-frame-pointer -O3 -flto -fno-exceptions -DIS_64BIT -DNDEBUG -Wall -Wextra -Wno-unused-variable -DUSE_NEON -flax-vector-conversions -march=native -MMD -MP -o Potential-DF0672B8 .tmp/bench.o .tmp/bit_manipulation.o .tmp/board_constants.o .tmp/evaluation.o .tmp/fen.o .tmp/history.o .tmp/magic.o .tmp/mask.o .tmp/move.o .tmp/perft.o .tmp/potential.o .tmp/search.o .tmp/see.o .tmp/table.o .tmp/timeman.o .tmp/uci.o .tmp/utils.o -pthread -lm  
lto1: error: unknown value ‘tigerlake’ for ‘-mtune’
lto1: note: valid arguments are: cortex-a34 cortex-a35 cortex-a53 cortex-a57 cortex-a72 cortex-a73 thunderx thunderxt88p1 thunderxt88 octeontx octeontx81 octeontx83 thunderxt81 thunderxt83 ampere1 emag xgene1 falkor qdf24xx exynos-m1 phecda thunderx2t99p1 vulcan thunderx2t99 cortex-a55 cortex-a75 cortex-a76 cortex-a76ae cortex-a77 cortex-a78 cortex-a78ae cortex-a78c cortex-a65 cortex-a65ae cortex-x1 ares neoverse-n1 neoverse-e1 octeontx2 octeontx2t98 octeontx2t96 octeontx2t93 octeontx2f95 octeontx2f95n octeontx2f95mm a64fx tsv110 thunderx3t110 zeus neoverse-v1 neoverse-512tvb saphira cortex-a57.cortex-a53 cortex-a72.cortex-a53 cortex-a73.cortex-a35 cortex-a73.cortex-a53 cortex-a75.cortex-a55 cortex-a76.cortex-a55 cortex-r82 cortex-a510 cortex-a710 cortex-x2 neoverse-n2 demeter generic
lto-wrapper: fatal error: gcc returned 1 exit status
compilation terminated.
/usr/bin/ld: error: lto-wrapper failed
collect2: error: ld returned 1 exit status
make: *** [makefile:181: Potential] Error 1