mkdir -p ".tmp" ".tmp/Source"
gcc -funroll-loops -fomit-frame-pointer -Ofast -flto -fno-exceptions -DIS_64BIT -DNDEBUG -Wall -Wextra -Wno-unused-variable -DUSE_NEON -flax-vector-conversions -mcpu=apple-a14 -MMD -MP -c bench.c -o .tmp/bench.o 
gcc -funroll-loops -fomit-frame-pointer -Ofast -flto -fno-exceptions -DIS_64BIT -DNDEBUG -Wall -Wextra -Wno-unused-variable -DUSE_NEON -flax-vector-conversions -mcpu=apple-a14 -MMD -MP -c bit_manipulation.c -o .tmp/bit_manipulation.o 
gcc -funroll-loops -fomit-frame-pointer -Ofast -flto -fno-exceptions -DIS_64BIT -DNDEBUG -Wall -Wextra -Wno-unused-variable -DUSE_NEON -flax-vector-conversions -mcpu=apple-a14 -MMD -MP -c board_constants.c -o .tmp/board_constants.o 
gcc -funroll-loops -fomit-frame-pointer -Ofast -flto -fno-exceptions -DIS_64BIT -DNDEBUG -Wall -Wextra -Wno-unused-variable -DUSE_NEON -flax-vector-conversions -mcpu=apple-a14 -MMD -MP -c evaluation.c -o .tmp/evaluation.o 
gcc -funroll-loops -fomit-frame-pointer -Ofast -flto -fno-exceptions -DIS_64BIT -DNDEBUG -Wall -Wextra -Wno-unused-variable -DUSE_NEON -flax-vector-conversions -mcpu=apple-a14 -MMD -MP -c fen.c -o .tmp/fen.o 
gcc -funroll-loops -fomit-frame-pointer -Ofast -flto -fno-exceptions -DIS_64BIT -DNDEBUG -Wall -Wextra -Wno-unused-variable -DUSE_NEON -flax-vector-conversions -mcpu=apple-a14 -MMD -MP -c history.c -o .tmp/history.o 
gcc -funroll-loops -fomit-frame-pointer -Ofast -flto -fno-exceptions -DIS_64BIT -DNDEBUG -Wall -Wextra -Wno-unused-variable -DUSE_NEON -flax-vector-conversions -mcpu=apple-a14 -MMD -MP -c magic.c -o .tmp/magic.o 
gcc -funroll-loops -fomit-frame-pointer -Ofast -flto -fno-exceptions -DIS_64BIT -DNDEBUG -Wall -Wextra -Wno-unused-variable -DUSE_NEON -flax-vector-conversions -mcpu=apple-a14 -MMD -MP -c mask.c -o .tmp/mask.o 
gcc -funroll-loops -fomit-frame-pointer -Ofast -flto -fno-exceptions -DIS_64BIT -DNDEBUG -Wall -Wextra -Wno-unused-variable -DUSE_NEON -flax-vector-conversions -mcpu=apple-a14 -MMD -MP -c move.c -o .tmp/move.o 
gcc -funroll-loops -fomit-frame-pointer -Ofast -flto -fno-exceptions -DIS_64BIT -DNDEBUG -Wall -Wextra -Wno-unused-variable -DUSE_NEON -flax-vector-conversions -mcpu=apple-a14 -MMD -MP -c perft.c -o .tmp/perft.o 
gcc -funroll-loops -fomit-frame-pointer -Ofast -flto -fno-exceptions -DIS_64BIT -DNDEBUG -Wall -Wextra -Wno-unused-variable -DUSE_NEON -flax-vector-conversions -mcpu=apple-a14 -MMD -MP -c potential.c -o .tmp/potential.o 
gcc -funroll-loops -fomit-frame-pointer -Ofast -flto -fno-exceptions -DIS_64BIT -DNDEBUG -Wall -Wextra -Wno-unused-variable -DUSE_NEON -flax-vector-conversions -mcpu=apple-a14 -MMD -MP -c search.c -o .tmp/search.o 
gcc -funroll-loops -fomit-frame-pointer -Ofast -flto -fno-exceptions -DIS_64BIT -DNDEBUG -Wall -Wextra -Wno-unused-variable -DUSE_NEON -flax-vector-conversions -mcpu=apple-a14 -MMD -MP -c see.c -o .tmp/see.o 
gcc -funroll-loops -fomit-frame-pointer -Ofast -flto -fno-exceptions -DIS_64BIT -DNDEBUG -Wall -Wextra -Wno-unused-variable -DUSE_NEON -flax-vector-conversions -mcpu=apple-a14 -MMD -MP -c table.c -o .tmp/table.o 
gcc -funroll-loops -fomit-frame-pointer -Ofast -flto -fno-exceptions -DIS_64BIT -DNDEBUG -Wall -Wextra -Wno-unused-variable -DUSE_NEON -flax-vector-conversions -mcpu=apple-a14 -MMD -MP -c time.c -o .tmp/time.o 
gcc -funroll-loops -fomit-frame-pointer -Ofast -flto -fno-exceptions -DIS_64BIT -DNDEBUG -Wall -Wextra -Wno-unused-variable -DUSE_NEON -flax-vector-conversions -mcpu=apple-a14 -MMD -MP -c uci.c -o .tmp/uci.o 
gcc -funroll-loops -fomit-frame-pointer -Ofast -flto -fno-exceptions -DIS_64BIT -DNDEBUG -Wall -Wextra -Wno-unused-variable -DUSE_NEON -flax-vector-conversions -mcpu=apple-a14 -MMD -MP -c utils.c -o .tmp/utils.o 
In file included from bench.c:5:
In file included from ./bench.h:12:
In file included from ./search.h:11:
In file included from ./time.h:18:
In file included from /Library/Developer/CommandLineTools/SDKs/MacOSX.sdk/usr/include/sys/time.h:185:
/Library/Developer/CommandLineTools/SDKs/MacOSX.sdk/usr/include/time.h:118:8: error: redefinition of 'time' as different kind of symbol
time_t time(time_t *);
       ^
./structs.h:130:3: note: previous definition is here
} time;
  ^
In file included from search.c:5:
In file included from ./search.h:11:
In file included from ./time.h:18:
In file included from /Library/Developer/CommandLineTools/SDKs/MacOSX.sdk/usr/include/sys/time.h:185:
/Library/Developer/CommandLineTools/SDKs/MacOSX.sdk/usr/include/time.h:118:8: error: redefinition of 'time' as different kind of symbol
time_t time(time_t *);
       ^
./structs.h:130:3: note: previous definition is here
} time;
  ^
In file included from potential.c:8:
In file included from ./uci.h:12:
In file included from ./time.h:18:
In file included from /Library/Developer/CommandLineTools/SDKs/MacOSX.sdk/usr/include/sys/time.h:185:
/Library/Developer/CommandLineTools/SDKs/MacOSX.sdk/usr/include/time.h:118:8: error: redefinition of 'time' as different kind of symbol
time_t time(time_t *);
       ^
./structs.h:130:3: note: previous definition is here
} time;
  ^
In file included from time.c:5:
In file included from ./time.h:18:
In file included from /Library/Developer/CommandLineTools/SDKs/MacOSX.sdk/usr/include/sys/time.h:185:
/Library/Developer/CommandLineTools/SDKs/MacOSX.sdk/usr/include/time.h:118:8: error: redefinition of 'time' as different kind of symbol
time_t time(time_t *);
       ^
./structs.h:130:3: note: previous definition is here
} time;
  ^
1 error generated.
make: *** [.tmp/potential.o] Error 1
make: *** Waiting for unfinished jobs....
1 error generated.
In file included from see.c:5:
In file included from ./see.h:11:
In file included from ./search.h:11:
In file included from ./time.h:18:
In file included from /Library/Developer/CommandLineTools/SDKs/MacOSX.sdk/usr/include/sys/time.h:185:
/Library/Developer/CommandLineTools/SDKs/MacOSX.sdk/usr/include/time.h:118:8: error: redefinition of 'time' as different kind of symbol
time_t time(time_t *);
       ^
./structs.h:130:3: note: previous definition is here
} time;
  ^
make: *** [.tmp/search.o] Error 1
1 error generated.
1 error generated.
make: *** [.tmp/bench.o] Error 1
make: *** [.tmp/time.o] Error 1
1 error generated.
In file included from uci.c:5:
In file included from ./uci.h:12:
In file included from ./time.h:18:
In file included from /Library/Developer/CommandLineTools/SDKs/MacOSX.sdk/usr/include/sys/time.h:185:
/Library/Developer/CommandLineTools/SDKs/MacOSX.sdk/usr/include/time.h:118:8: error: redefinition of 'time' as different kind of symbol
time_t time(time_t *);
       ^
./structs.h:130:3: note: previous definition is here
} time;
  ^
make: *** [.tmp/see.o] Error 1
1 error generated.
make: *** [.tmp/uci.o] Error 1