git submodule update --init --recursive --depth 1
fatal: not a git repository (or any parent up to mount point /)
Stopping at filesystem boundary (GIT_DISCOVERY_ACROSS_FILESYSTEM not set).
make: [Makefile:16: net] Error 128 (ignored)
zig build --release=fast install -Dnet=/home/jonathanhallstrom/dev/python/RektdieBench/Client/Networks/E3B0C442 -Druntime_net
install
+- install pawnocchio
   +- zig build-exe pawnocchio ReleaseFast native 3 errors
src/engine.zig:358:20: error: root source file struct 'std' has no member named 'array_list'
    var fens = std.array_list.Managed([]const u8).init(allocator);
                   ^~~~~~~~~~
/home/jonathanhallstrom/.zvm/0.14.1/lib/std/std.zig:1:1: note: struct declared here
pub const ArrayHashMap = array_hash_map.ArrayHashMap;
^~~
referenced by:
    main: src/main.zig:151:40
    main: /home/jonathanhallstrom/.zvm/0.14.1/lib/std/start.zig:660:37
    3 reference(s) hidden; use '-freference-trace=5' to see all references
src/root.zig:89:33: error: root source file struct 'fs.File' has no member named 'stdout'
            stdout = std.fs.File.stdout();
                     ~~~~~~~~~~~^~~~~~~
/home/jonathanhallstrom/.zvm/0.14.1/lib/std/fs/File.zig:1:1: note: struct declared here
/// The OS-specific file descriptor or file handle.
^~~~~~~~~~~~~~~~~~~~~~~~~~~~~~~~~~~~~~~~~~~~~~~~~~~
src/root.zig:107:27: error: no field named 'interface' in struct 'io.GenericWriter(fs.File,error{SystemResources,Unexpected,DiskQuota,FileTooBig,InputOutput,NoSpaceLeft,DeviceBusy,InvalidArgument,AccessDenied,BrokenPipe,OperationAborted,NotOpenForWriting,LockViolation,WouldBlock,ConnectionResetByPeer,ProcessNotFound,NoDevice},(function 'write'))'
            stdout_writer.interface.flush() catch std.debug.panic("failed to flush stdout", .{});
                          ^~~~~~~~~
/home/jonathanhallstrom/.zvm/0.14.1/lib/std/io.zig:297:12: note: struct declared here
    return struct {
           ^~~~~~
error: the following command failed with 3 compilation errors:
/home/jonathanhallstrom/.zvm/0.14.1/zig build-exe -cflags -fno-sanitize=undefined -O3 -- -x c /tmp/tmpip2a3axc/Eleanor/Eleanor-tmp/src/Pyrrhic/tbprobe.c -x none -fstrip -fomit-frame-pointer -OReleaseFast -I /tmp/tmpip2a3axc/Eleanor/Eleanor-tmp/src/Pyrrhic --dep build_options --dep net -Mroot=/tmp/tmpip2a3axc/Eleanor/Eleanor-tmp/src/main.zig -Mbuild_options=/tmp/tmpip2a3axc/Eleanor/Eleanor-tmp/.zig-cache/c/d91e483b7db13f70b8d0e4d6f5e1ed00/options.zig -Mnet=/home/jonathanhallstrom/dev/python/RektdieBench/Client/Networks/E3B0C442 -lc --cache-dir /tmp/tmpip2a3axc/Eleanor/Eleanor-tmp/.zig-cache --global-cache-dir /root/.cache/zig --name pawnocchio --zig-lib-dir /home/jonathanhallstrom/.zvm/0.14.1/lib/ --listen=- 
Build Summary: 1/4 steps succeeded; 1 failed
install transitive failure
+- install pawnocchio transitive failure
   +- zig build-exe pawnocchio ReleaseFast native 3 errors
error: the following build command failed with exit code 1:
/tmp/tmpip2a3axc/Eleanor/Eleanor-tmp/.zig-cache/o/9291e071e014fc7804b779f6a63cb386/build /home/jonathanhallstrom/.zvm/0.14.1/zig /home/jonathanhallstrom/.zvm/0.14.1/lib /tmp/tmpip2a3axc/Eleanor/Eleanor-tmp /tmp/tmpip2a3axc/Eleanor/Eleanor-tmp/.zig-cache /root/.cache/zig --seed 0x9a1936c2 -Z8d02dea1fbce39b1 --release=fast install -Dnet=/home/jonathanhallstrom/dev/python/RektdieBench/Client/Networks/E3B0C442 -Druntime_net
make: *** [Makefile:25: default] Error 1